Gradle install


#1

Hello, I have a question
I want to create an APP but I always get an error showing someone what to do

BUILD FAILED in 2s
cmd: Command failed with exit code 1 Error output:
FAILURE: Build failed with an exception.

  • What went wrong:
    A problem occurred configuring project ‘:CordovaLib’.

No toolchains found in the NDK toolchains folder for ABI with prefix: mips64el-linux-android

  • Try:
    Run with --stacktrace option to get the stack trace. Run with --info or --debug option to get more log output.

  • Get more help at https://help.gradle.org

BUILD FAILED in 2s
Error emulating your Cordova Project for android!